Reaction Details
TargetDipeptidyl peptidase 4
LigandBDBM11708
Substrate/CompetitorBDBM11526
Meas. Tech.Dipeptidyl Peptidase Inhibition Assay
IC50 369±n/a nM
Citation Tsu, HChen, XChen, CTLee, SJChang, CNKao, KHCoumar, MSYeh, YTChien, CHWang, HSLin, KTChang, YYWu, SHChen, YSLu, ILWu, SYTsai, TYChen, WCHsieh, HPChao, YSJiaang, WT 2-[3-[2-[(2S)-2-Cyano-1-pyrrolidinyl]-2-oxoethylamino]-3-methyl-1-oxobutyl]-1,2,3,4-tetrahydroisoquinoline: a potent, selective, and orally bioavailable dipeptide-derived inhibitor of dipeptidyl peptidase IV. J Med Chem49:373-80 (2006) 
 
Dipeptidyl peptidase 4
Name:Dipeptidyl peptidase 4
Type:Enzyme
Mol. Mass.:88271.01
Organism:Homo sapiens (Human)
Description:P27487
Residue:766
BDBM11708
BDBM11526
NameBDBM11708
Synonyms:(2S)-Cyanopyrrolidine analogue 18l 3-[2-(2-Cyano-(S)-pyrrolidin-1-yl)-2-oxoethylamino]-N-(3,5-difluorobenzyl)propionamide
TypeSmall organic molecule
Emp. Form.C17H20F2N4O2
Mol. Mass.350.3631
SMILESFc1cc(F)cc(CNC(=O)CCNCC(=O)N2CCC[C@H]2C#N)c1