Reaction Details
TargetDipeptidyl peptidase 8
LigandBDBM11700
Substrate/CompetitorBDBM11526
Meas. Tech.Dipeptidyl Peptidase Inhibition Assay
IC50 2121±n/a nM
Citation Tsu, HChen, XChen, CTLee, SJChang, CNKao, KHCoumar, MSYeh, YTChien, CHWang, HSLin, KTChang, YYWu, SHChen, YSLu, ILWu, SYTsai, TYChen, WCHsieh, HPChao, YSJiaang, WT 2-[3-[2-[(2S)-2-Cyano-1-pyrrolidinyl]-2-oxoethylamino]-3-methyl-1-oxobutyl]-1,2,3,4-tetrahydroisoquinoline: a potent, selective, and orally bioavailable dipeptide-derived inhibitor of dipeptidyl peptidase IV. J Med Chem49:373-80 (2006) 
 
Dipeptidyl peptidase 8
Name:Dipeptidyl peptidase 8
Type:Enzyme
Mol. Mass.:103342.62
Organism:Homo sapiens (Human)
Description:Q6V1X1
Residue:898
BDBM11700
BDBM11526
NameBDBM11700
Synonyms:(2S)-1-(2-{[3-(2,3-dihydro-1H-isoindol-2-yl)-3-oxopropyl]amino}acetyl)pyrrolidine-2-carbonitrile 2-[3-[2-[2-Cyano-(S)-pyrrolidin-1-yl]-2-oxoethylamino]-1-oxo-propyl]1,3-dihydroisoindole
TypeSmall organic molecule
Emp. Form.C18H22N4O2
Mol. Mass.326.3929
SMILESO=C(CCNCC(=O)N1CCC[C@H]1C#N)N1Cc2ccccc2C1