Reaction Details
TargetRibosomal protein S6 kinase beta-1
LigandBDBM224326
Substrate/Competitorn/a
Meas. Tech.Enzyme Assay
IC50 2.60±n/a nM
Citation Lan, RHuck, BRChen, XDeselm, LCQiu, HXiao, YNeagu, CMochalkin, IJohnson, TL Aminopyrimidine derivatives for use as modulators of kinase activity US Patent US9662330 Publication Date 5/30/2017
 
Ribosomal protein S6 kinase beta-1
Name:Ribosomal protein S6 kinase beta-1
Type:Enzyme
Mol. Mass.:59139.89
Organism:Homo sapiens (Human)
Description:His-tagged S6K1.
Residue:525
BDBM224326
NameBDBM224326
Synonyms:US10080750, Compound 3 US9662330, Compound 3
TypeSmall organic molecule
Emp. Form.C23H24F4N6
Mol. Mass.460.4705
SMILESNC[C@@H](N1CCN(CC1)c1ncnc(N)c1-c1ccc(F)cc1)c1ccc(cc1)C(F)(F)F