Reaction Details
TargetRibosomal protein S6 kinase beta-1
LigandBDBM224376
Substrate/Competitorn/a
Meas. Tech.Enzyme Assay
IC50 3.20±n/a nM
Citation Lan, RHuck, BRChen, XDeselm, LCQiu, HXiao, YNeagu, CMochalkin, IJohnson, TL Aminopyrimidine derivatives for use as modulators of kinase activity US Patent US9662330 Publication Date 5/30/2017
 
Ribosomal protein S6 kinase beta-1
Name:Ribosomal protein S6 kinase beta-1
Type:Enzyme
Mol. Mass.:59139.89
Organism:Homo sapiens (Human)
Description:His-tagged S6K1.
Residue:525
BDBM224376
NameBDBM224376
Synonyms:US10080750, Compound 53 US9662330, Compound 53
TypeSmall organic molecule
Emp. Form.C24H25F4N5
Mol. Mass.459.4824
SMILESNC[C@@H](C1CCN(CC1)c1ncnc(N)c1-c1ccc(F)cc1)c1ccc(cc1)C(F)(F)F