Reaction Details
TargetRibosomal protein S6 kinase beta-1
LigandBDBM224508
Substrate/Competitorn/a
Meas. Tech.Enzyme Assay
IC50 1.40±n/a nM
Citation Lan, RHuck, BRChen, XDeselm, LCQiu, HXiao, YNeagu, CMochalkin, IJohnson, TL Aminopyrimidine derivatives for use as modulators of kinase activity US Patent US9662330 Publication Date 5/30/2017
 
Ribosomal protein S6 kinase beta-1
Name:Ribosomal protein S6 kinase beta-1
Type:Enzyme
Mol. Mass.:59139.89
Organism:Homo sapiens (Human)
Description:His-tagged S6K1.
Residue:525
BDBM224508
NameBDBM224508
Synonyms:US10080750, Compound 186 US9662330, Compound 186
TypeSmall organic molecule
Emp. Form.C20H23F3N8O
Mol. Mass.448.4448
SMILESNCC(N1CCN(CC1)c1ncnc(N)c1-c1cn[nH]c1)c1ccc(OC(F)(F)F)cc1