Reaction Details
TargetDipeptidyl peptidase 8
LigandBDBM12656
Substrate/CompetitorBDBM11057
Meas. Tech.DPP Inhibition Assay
pH7.5±n/a
Temperature295.15±n/a K
Ki>30000±n/a nM
Citation Pei, ZLi, Xvon Geldern, TWMadar, DJLongenecker, KYong, HLubben, THStewart, KDZinker, BABackes, BJJudd, ASMulhern, MBallaron, SJStashko, MAMika, AKBeno, DWReinhart, GAFryer, RMPreusser, LCKempf-Grote, AJSham, HLTrevillyan, JM Discovery of ((4R,5S)-5-amino-4-(2,4,5- trifluorophenyl)cyclohex-1-enyl)-(3- (trifluoromethyl)-5,6-dihydro- [1,2,4]triazolo[4,3-a]pyrazin-7(8H)-yl)methanone (ABT-341), a highly potent, selective, orally efficacious, and safe dipeptidyl peptidase IV inhibitor for the treatment of type 2 diabetes. J Med Chem49:6439-42 (2006) 
 
Dipeptidyl peptidase 8
Name:Dipeptidyl peptidase 8
Type:Enzyme
Mol. Mass.:103342.62
Organism:Homo sapiens (Human)
Description:Q6V1X1
Residue:898
BDBM12656
BDBM11057
NameBDBM12656
Synonyms:((4R,5S)-5-Amino-4-(2,4,5-trifluorophenyl)cyclohex-1-enyl)-(3-(trifluoromethyl)-5,6-dihydro-[1,2,4]triazolo[4,3-a]pyrazin-7(8H)-yl)methanone (1S,6R)-3-{[3-(trifluoromethyl)-5H,6H,7H,8H-[1,2,4]triazolo[3,4-a]pyrazin-7-yl]carbonyl}-6-(2,4,5-trifluorophenyl)cyclohex-3-en-1-aminium; 2,2,2-trifluoroacetate | ABT-341
TypeSmall organic molecule
Emp. Form.C19H18F6N5O
Mol. Mass.446.369
SMILES[NH3+][C@H]1CC(=CC[C@@H]1c1cc(F)c(F)cc1F)C(=O)N1CCn2c(C1)nnc2C(F)(F)F