Reaction Details
TargetCoagulation factor X
LigandBDBM12665
Substrate/CompetitorBDBM12658
Meas. Tech.Enzyme Assay and Determination of the Inhibition Constants.
pH7±n/a
Temperature295.15±n/a K
Ki 6.30±n/a nM
Citation Quan, MLLam, PYHan, QPinto, DJHe, MYLi, REllis, CDClark, CGTeleha, CASun, JHAlexander, RSBai, SLuettgen, JMKnabb, RMWong, PCWexler, RR Discovery of 1-(3'-aminobenzisoxazol-5'-yl)-3-trifluoromethyl-N-[2-fluoro-4-[(2'-dimethylaminomethyl)imidazol-1-yl]phenyl]-1H-pyrazole-5-carboxyamide hydrochloride (razaxaban), a highly potent, selective, and orally bioavailable factor Xa inhibitor. J Med Chem48:1729-44 (2005) 
 
Coagulation factor X
Name:Coagulation factor X
Type:Enzyme
Mol. Mass.:54726.60
Organism:Homo sapiens (Human)
Description:n/a
Residue:488
BDBM12665
BDBM12658
NameBDBM12665
Synonyms:1-(3-Aminobenzisoxazol-5-yl)-3-trifluoromethyl-5-[(2-fluoro-4-morpholinophenyl)aminocarbonyl]pyrazole, Trifluoroacetic Acid salt Razaxaban Analogue | aminobenzisoxazole 41
TypeSmall organic molecule
Emp. Form.C22H18F4N6O3
Mol. Mass.490.4103
SMILESNc1noc2ccc(cc12)-n1nc(cc1C(=O)Nc1ccc(cc1F)N1CCOCC1)C(F)(F)F