Reaction Details
TargetCoagulation factor X
LigandBDBM12666
Substrate/CompetitorBDBM12658
Meas. Tech.Enzyme Assay and Determination of the Inhibition Constants.
pH7±n/a
Temperature295.15±n/a K
Ki 0.52±n/a nM
Citation Quan, MLLam, PYHan, QPinto, DJHe, MYLi, REllis, CDClark, CGTeleha, CASun, JHAlexander, RSBai, SLuettgen, JMKnabb, RMWong, PCWexler, RR Discovery of 1-(3'-aminobenzisoxazol-5'-yl)-3-trifluoromethyl-N-[2-fluoro-4-[(2'-dimethylaminomethyl)imidazol-1-yl]phenyl]-1H-pyrazole-5-carboxyamide hydrochloride (razaxaban), a highly potent, selective, and orally bioavailable factor Xa inhibitor. J Med Chem48:1729-44 (2005) 
 
Coagulation factor X
Name:Coagulation factor X
Type:Enzyme
Mol. Mass.:54726.60
Organism:Homo sapiens (Human)
Description:n/a
Residue:488
BDBM12666
BDBM12658
NameBDBM12666
Synonyms:1-(3-Aminobenzisoxazol-5-yl)-3-trifluoromethyl-5-[[(2-cyano-4-(2-methylimidazol-1-yl)phenyl]aminocarbonyl]-pyrazole, Bis(trifluoroacetic acid) Salt Razaxaban Analogue | aminobenzisoxazole 42
TypeSmall organic molecule
Emp. Form.C23H15F3N8O2
Mol. Mass.492.4128
SMILESCc1nccn1-c1ccc(NC(=O)c2cc(nn2-c2ccc3onc(N)c3c2)C(F)(F)F)c(c1)C#N