Reaction Details
TargetProthrombin
LigandBDBM12671
Substrate/CompetitorBDBM12678
Meas. Tech.Enzyme Assay and Determination of the Inhibition Constants.
Ki 900±n/a nM
Citation Quan, MLLam, PYHan, QPinto, DJHe, MYLi, REllis, CDClark, CGTeleha, CASun, JHAlexander, RSBai, SLuettgen, JMKnabb, RMWong, PCWexler, RR Discovery of 1-(3'-aminobenzisoxazol-5'-yl)-3-trifluoromethyl-N-[2-fluoro-4-[(2'-dimethylaminomethyl)imidazol-1-yl]phenyl]-1H-pyrazole-5-carboxyamide hydrochloride (razaxaban), a highly potent, selective, and orally bioavailable factor Xa inhibitor. J Med Chem48:1729-44 (2005) 
 
Prothrombin
Name:Prothrombin
Type:Protein
Mol. Mass.:70029.57
Organism:Homo sapiens (Human)
Description:P00734
Residue:622
BDBM12671
BDBM12678
NameBDBM12671
Synonyms:1-(3-Aminobenzisoxazol-5-yl)-3-trifluoromethyl-5-[[4-(2-ethylimidazol-1-yl)-2-fluorophenyl]aminocarbonyl]-pyrazole, Bis(trifluoroacetic acid) Salt Razaxaban Analogue | aminobenzisoxazole 11b
TypeSmall organic molecule
Emp. Form.C23H17F4N7O2
Mol. Mass.499.4204
SMILESCCc1nccn1-c1ccc(NC(=O)c2cc(nn2-c2ccc3onc(N)c3c2)C(F)(F)F)c(F)c1