Reaction Details
TargetProthrombin
LigandBDBM12674
Substrate/CompetitorBDBM12678
Meas. Tech.Enzyme Assay and Determination of the Inhibition Constants.
Ki 3500±n/a nM
Citation Quan, MLLam, PYHan, QPinto, DJHe, MYLi, REllis, CDClark, CGTeleha, CASun, JHAlexander, RSBai, SLuettgen, JMKnabb, RMWong, PCWexler, RR Discovery of 1-(3'-aminobenzisoxazol-5'-yl)-3-trifluoromethyl-N-[2-fluoro-4-[(2'-dimethylaminomethyl)imidazol-1-yl]phenyl]-1H-pyrazole-5-carboxyamide hydrochloride (razaxaban), a highly potent, selective, and orally bioavailable factor Xa inhibitor. J Med Chem48:1729-44 (2005) 
 
Prothrombin
Name:Prothrombin
Type:Protein
Mol. Mass.:70029.57
Organism:Homo sapiens (Human)
Description:P00734
Residue:622
BDBM12674
BDBM12678
NameBDBM12674
Synonyms:1-(3-amino-1,2-benzoxazol-5-yl)-N-{4-[2-(aminomethyl)-1H-imidazol-1-yl]-2-fluorophenyl}-3-(trifluoromethyl)-1H-pyrazole-5-carboxamide; bis(2,2,2-trifluoroacetic acid) Razaxaban Analogue | aminobenzisoxazole 37
TypeSmall organic molecule
Emp. Form.C22H16F4N8O2
Mol. Mass.500.4085
SMILESNCc1nccn1-c1ccc(NC(=O)c2cc(nn2-c2ccc3onc(N)c3c2)C(F)(F)F)c(F)c1