Reaction Details
TargetSerine protease 1
LigandBDBM12664
Substrate/CompetitorBDBM12679
Meas. Tech.Enzyme Assay and Determination of the Inhibition Constants.
Ki>5200±n/a nM
Citation Quan, MLLam, PYHan, QPinto, DJHe, MYLi, REllis, CDClark, CGTeleha, CASun, JHAlexander, RSBai, SLuettgen, JMKnabb, RMWong, PCWexler, RR Discovery of 1-(3'-aminobenzisoxazol-5'-yl)-3-trifluoromethyl-N-[2-fluoro-4-[(2'-dimethylaminomethyl)imidazol-1-yl]phenyl]-1H-pyrazole-5-carboxyamide hydrochloride (razaxaban), a highly potent, selective, and orally bioavailable factor Xa inhibitor. J Med Chem48:1729-44 (2005) 
 
Serine protease 1
Name:Serine protease 1
Type:Enzyme
Mol. Mass.:25790.52
Organism:Bos taurus (bovine)
Description:P00760
Residue:246
BDBM12664
BDBM12679
NameBDBM12664
Synonyms:1-(3-Aminobenzisoxazol-5-yl)-3-trifluoromethyl-5-[2-fluoro-4-(N-pyrrolidinocarbonyl)phenylaminocarbonyl]-pyrazole Trifluoroacetate, Trifluoroacetic Acid Salt Razaxaban Analogue | aminobenzisoxazole 40
TypeSmall organic molecule
Emp. Form.C23H18F4N6O3
Mol. Mass.502.421
SMILESNc1noc2ccc(cc12)-n1nc(cc1C(=O)Nc1ccc(cc1F)C(=O)N1CCCC1)C(F)(F)F