Reaction Details
TargetCoagulation factor IX
LigandBDBM12676
Substrate/CompetitorBDBM12679
Meas. Tech.Enzyme Assay and Determination of the Inhibition Constants.
Ki 9000±n/a nM
Citation Quan, MLLam, PYHan, QPinto, DJHe, MYLi, REllis, CDClark, CGTeleha, CASun, JHAlexander, RSBai, SLuettgen, JMKnabb, RMWong, PCWexler, RR Discovery of 1-(3'-aminobenzisoxazol-5'-yl)-3-trifluoromethyl-N-[2-fluoro-4-[(2'-dimethylaminomethyl)imidazol-1-yl]phenyl]-1H-pyrazole-5-carboxyamide hydrochloride (razaxaban), a highly potent, selective, and orally bioavailable factor Xa inhibitor. J Med Chem48:1729-44 (2005) 
 
Coagulation factor IX
Name:Coagulation factor IX
Type:Enzyme
Mol. Mass.:51768.83
Organism:Homo sapiens (Human)
Description:P00740
Residue:461
BDBM12676
BDBM12679
NameBDBM12676
Synonyms:1-(3-Aminobenzisoxazol-5-yl)-3-trifluoromethyl-N-[2-fluoro-4-[(2-dimethylaminomethyl)imidazol-1-yl]phenyl]-1H-pyrazole-5-carboxyamide Hydrochloride Salt BMS-561389 CHEMBL558198 Razaxaban
TypeSmall organic molecule
Emp. Form.C24H20F4N8O2
Mol. Mass.528.4616
SMILESCN(C)Cc1nccn1-c1ccc(NC(=O)c2cc(nn2-c2ccc3onc(N)c3c2)C(F)(F)F)c(F)c1