Reaction Details
TargetInduced myeloid leukemia cell differentiation protein Mcl-1
LigandBDBM333146
Substrate/Competitorn/a
Meas. Tech.Biochemical binding TR-FRET assay
IC50<3.00±n/a nM
Citation Hird, ABelmonte, MYang, WSecrist, PRobbins, DKazmirski, SWu, DPeng, BJohannes, JLamb, MYe, QZheng, X MCL-1 inhibitors and methods of use thereof US Patent US10196404 Publication Date 2/5/2019
 
Induced myeloid leukemia cell differentiation protein Mcl-1
Name:Induced myeloid leukemia cell differentiation protein Mcl-1
Type:Membrane; Single-pass membrane protein
Mol. Mass.:37332.87
Organism:Homo sapiens (Human)
Description:Q07820
Residue:350
BDBM333146
NameBDBM333146
Synonyms:Compound I US10196404, Example 2 US11472816, Example 3 | US11691989, Compound AZD5991
TypeSmall organic molecule
Emp. Form.C35H34ClN5O3S2
Mol. Mass.672.259
SMILESCc1c-2c(CSCc3cc(CSc4cc(OCCCc5c(C(O)=O)n(C)c6c-2c(Cl)ccc56)c2ccccc2c4)n(C)n3)nn1C