Reaction Details
TargetPhosphatidylinositol 4,5-bisphosphate 3-kinase catalytic subunit delta isoform
LigandBDBM334016
Substrate/Competitorn/a
Meas. Tech.Biochemical Assay
IC50<1.000±n/a nM
Citation Achab, AAAltman, MDDeng, YGuzi, TKattar, SKatz, JDMethot, JLZhou, HMcGowan, MChristopher, MPGarcia, YAnthony, NJFradera Llinas, FXFong, KCLeng, XMu, CZhang, SZhang, R Purine inhibitors of human phosphatidylinositol 3-kinase delta US Patent US9730940 Publication Date 8/15/2017
 
Phosphatidylinositol 4,5-bisphosphate 3-kinase catalytic subunit delta isoform
Name:Phosphatidylinositol 4,5-bisphosphate 3-kinase catalytic subunit delta isoform
Type:Enzyme Subunit
Mol. Mass.:119489.41
Organism:Homo sapiens (Human)
Description:O00329
Residue:1044
BDBM334016
NameBDBM334016
Synonyms:9-ethyl-6-({(3S)-1-[([(1R,2S) or (1R,2R) or (1S,2R) or (1S,2S)]- methylcyclobutyl)carbonyl] pyrrolidin-3-yl}oxy)-8-(2- methylpyrimidin-5-yl)-9H- purine US9730940, Compound 2-118 US9730940, Compound 2-120
TypeSmall organic molecule
Emp. Form.C22H27N7O2
Mol. Mass.421.4955
SMILESCCn1c(nc2c(O[C@H]3CCN(C3)C(=O)C3CCC3C)ncnc12)-c1cnc(C)nc1