Reaction Details
TargetApoptosis regulator Bcl-2
LigandBDBM341098
Substrate/Competitorn/a
Meas. Tech.Fluorescence Polarisation Assay
IC50 3.20±n/a nM
Citation Casara, PLe Diguarher, THenlin, JStarck, JLe Tiran, ADe Nanteuil, GGeneste, ODavidson, JEMurray, JBChen, IWalmsley, CGraham, CJRay, SMaddox, DBedford, S Indole and pyrrole compounds, a process for their preparation and pharmaceutical compositions containing them US Patent US9765056 Publication Date 9/19/2017
 
Apoptosis regulator Bcl-2
Name:Apoptosis regulator Bcl-2
Type:Homodimer or heterodimer
Mol. Mass.:26269.11
Organism:Homo sapiens (Human)
Description:P10415
Residue:239
BDBM341098
NameBDBM341098
Synonyms:1-{4-Hydroxy-5-methoxy-2-[(3S)-3-[(4-methylpiperazin-1-yl)methyl]-1,2,3,4-tetrahydroisoquinoline-2-carbonyl]phenyl}-N-(4-hydroxyphenyl)-N-phenyl-1H-indole-3-carboxamide dihydrochloride | US9765056, Example 165
TypeSmall organic molecule
Emp. Form.C44H43N5O5
Mol. Mass.721.8427
SMILESCOc1cc(c(cc1O)C(=O)N1Cc2ccccc2C[C@H]1CN1CCN(C)CC1)-n1cc(C(=O)N(c2ccccc2)c2ccc(O)cc2)c2ccccc12