Reaction Details
TargetMitotic checkpoint serine/threonine-protein kinase BUB1
LigandBDBM341151
Substrate/Competitorn/a
Meas. Tech.Time-Resolved Fluorescence Energy Transfer (TR-FRET) Kinase Assay
IC50 4.70±n/a nM
Citation Hitchcock, MMengel, ARichter, ABriem, HSiemeister, GBone, WFernandez-Montalvan, AESchröder, JHolton, SPreuβe, CMönning, U Substituted benzylpyrazoles US Patent US9765058 Publication Date 9/19/2017
 
Mitotic checkpoint serine/threonine-protein kinase BUB1
Name:Mitotic checkpoint serine/threonine-protein kinase BUB1
Type:PROTEIN
Mol. Mass.:122372.31
Organism:Homo sapiens (Human)
Description:ChEMBL_1510603
Residue:1085
BDBM341151
NameBDBM341151
Synonyms:4-({2-[4-chloro-5-cyclopropyl-1-(4-ethoxy-2,6-difluorobenzyl)-1H-pyrazol-3-yl]pyrimidin-4-yl}amino)-N-methylnicotinamide | US9765058, Example 2-1-1
TypeSmall organic molecule
Emp. Form.C26H24ClF2N7O2
Mol. Mass.539.964
SMILESCCOc1cc(F)c(Cn2nc(c(Cl)c2C2CC2)-c2nccc(Nc3ccncc3C(=O)NC)n2)c(F)c1