Reaction Details
TargetMitotic checkpoint serine/threonine-protein kinase BUB1
LigandBDBM341158
Substrate/Competitorn/a
Meas. Tech.Time-Resolved Fluorescence Energy Transfer (TR-FRET) Kinase Assay
IC50 41.0±n/a nM
Citation Hitchcock, MMengel, ARichter, ABriem, HSiemeister, GBone, WFernandez-Montalvan, AESchröder, JHolton, SPreuβe, CMönning, U Substituted benzylpyrazoles US Patent US9765058 Publication Date 9/19/2017
 
Mitotic checkpoint serine/threonine-protein kinase BUB1
Name:Mitotic checkpoint serine/threonine-protein kinase BUB1
Type:PROTEIN
Mol. Mass.:122372.31
Organism:Homo sapiens (Human)
Description:ChEMBL_1510603
Residue:1085
BDBM341158
NameBDBM341158
Synonyms:US9765058, Example 2-2-6
TypeSmall organic molecule
Emp. Form.C23H21F3N6O2
Mol. Mass.470.447
SMILESCCOc1cc(F)c(Cn2nc(c(F)c2C)-c2ncc(OC)c(Nc3ccncc3)n2)c(F)c1