Reaction Details
TargetMitotic checkpoint serine/threonine-protein kinase BUB1
LigandBDBM341166
Substrate/Competitorn/a
Meas. Tech.Time-Resolved Fluorescence Energy Transfer (TR-FRET) Kinase Assay
IC50 54.0±n/a nM
Citation Hitchcock, MMengel, ARichter, ABriem, HSiemeister, GBone, WFernandez-Montalvan, AESchröder, JHolton, SPreuβe, CMönning, U Substituted benzylpyrazoles US Patent US9765058 Publication Date 9/19/2017
 
Mitotic checkpoint serine/threonine-protein kinase BUB1
Name:Mitotic checkpoint serine/threonine-protein kinase BUB1
Type:PROTEIN
Mol. Mass.:122372.31
Organism:Homo sapiens (Human)
Description:ChEMBL_1510603
Residue:1085
BDBM341166
NameBDBM341166
Synonyms:Preparation of 4-({2-[4-chloro-5-cyclopropyl-1-(4-ethoxy-2,6-difluorobenzyl)-1H-pyrazol-3-yl]pyrimidin-4-yl}amino)-N-(2-hydroxyethyl)nicotinamide | US9765058, Example 2-4-1
TypeSmall organic molecule
Emp. Form.C27H26ClF2N7O3
Mol. Mass.569.99
SMILESCCOc1cc(F)c(Cn2nc(c(Cl)c2C2CC2)-c2nccc(Nc3ccncc3C(=O)NCCO)n2)c(F)c1