Reaction Details
TargetMitotic checkpoint serine/threonine-protein kinase BUB1
LigandBDBM341165
Substrate/Competitorn/a
Meas. Tech.Time-Resolved Fluorescence Energy Transfer (TR-FRET) Kinase Assay
IC50 13.0±n/a nM
Citation Hitchcock, MMengel, ARichter, ABriem, HSiemeister, GBone, WFernandez-Montalvan, AESchröder, JHolton, SPreuβe, CMönning, U Substituted benzylpyrazoles US Patent US9765058 Publication Date 9/19/2017
 
Mitotic checkpoint serine/threonine-protein kinase BUB1
Name:Mitotic checkpoint serine/threonine-protein kinase BUB1
Type:PROTEIN
Mol. Mass.:122372.31
Organism:Homo sapiens (Human)
Description:ChEMBL_1510603
Residue:1085
BDBM341165
NameBDBM341165
Synonyms:US9765058, Example 2-3-2 | US9765058, Example 2-4-2
TypeSmall organic molecule
Emp. Form.C24H22ClF2N7O3
Mol. Mass.529.926
SMILESCCOc1cc(F)c(Cn2cc(Cl)c(n2)-c2ncc(OC)c(Nc3ccncc3C(=O)NC)n2)c(F)c1