Reaction Details
TargetSerine protease 1
LigandBDBM14142
Substrate/CompetitorBDBM12679
Meas. Tech.Enzyme Assay and Determination of the Inhibition Constants
pH7.45±n/a
Temperature295.15±n/a K
Ki 11±n/a nM
CommentspH where Ki is lowest (pH(min)), and Ki(min) toward bovine trypsin.
Citation Katz, BAElrod, KVerner, EMackman, RLLuong, CShrader, WDSendzik, MSpencer, JRSprengeler, PAKolesnikov, ATai, VWHui, HCBreitenbucher, JGAllen, DJanc, JW Elaborate manifold of short hydrogen bond arrays mediating binding of active site-directed serine protease inhibitors. J Mol Biol329:93-120 (2003) 
 
Serine protease 1
Name:Serine protease 1
Type:Enzyme
Mol. Mass.:25790.52
Organism:Bos taurus (bovine)
Description:P00760
Residue:246
BDBM14142
BDBM12679
NameBDBM14142
Synonyms:2-{5-[amino(iminiumyl)methyl]-1H-indol-2-yl}-6-phenylbenzen-1-olate APC-8696 CRA-8696
TypeSmall organic molecule
Emp. Form.C21H17N3O
Mol. Mass.327.3792
SMILESNC(=[NH2+])c1ccc2[nH]c(cc2c1)-c1cccc(-c2ccccc2)c1[O-]