Reaction Details
TargetSerine protease 1
LigandBDBM14338
Substrate/CompetitorBDBM12679
Meas. Tech.Enzyme Assay and Determination of the Inhibition Constants
Ki 1.3±n/a nM
Citation Katz, BAElrod, KVerner, EMackman, RLLuong, CShrader, WDSendzik, MSpencer, JRSprengeler, PAKolesnikov, ATai, VWHui, HCBreitenbucher, JGAllen, DJanc, JW Elaborate manifold of short hydrogen bond arrays mediating binding of active site-directed serine protease inhibitors. J Mol Biol329:93-120 (2003) 
 
Serine protease 1
Name:Serine protease 1
Type:Enzyme
Mol. Mass.:25790.52
Organism:Bos taurus (bovine)
Description:P00760
Residue:246
BDBM14338
BDBM12679
NameBDBM14338
Synonyms:2-{5-[amino(iminiumyl)methyl]-1H-indol-2-yl}-4-nitro-6-phenylbenzen-1-olate | CRA-15566
TypeSmall organic molecule
Emp. Form.C21H16N4O3
Mol. Mass.372.3767
SMILESNC(=[NH2+])c1ccc2[nH]c(cc2c1)-c1cc(cc(-c2ccccc2)c1[O-])[N+]([O-])=O