Reaction Details
TargetUrokinase-type plasminogen activator
LigandBDBM14354
Substrate/CompetitorBDBM13949
Meas. Tech.Enzyme Assay and Determination of the Inhibition Constants
Ki 3.2±n/a nM
Citation Katz, BAElrod, KVerner, EMackman, RLLuong, CShrader, WDSendzik, MSpencer, JRSprengeler, PAKolesnikov, ATai, VWHui, HCBreitenbucher, JGAllen, DJanc, JW Elaborate manifold of short hydrogen bond arrays mediating binding of active site-directed serine protease inhibitors. J Mol Biol329:93-120 (2003) 
 
Urokinase-type plasminogen activator
Name:Urokinase-type plasminogen activator
Type:Enzyme
Mol. Mass.:48528.62
Organism:Homo sapiens (Human)
Description:P00749
Residue:431
BDBM14354
BDBM13949
NameBDBM14354
Synonyms:2-{5-[amino(iminiumyl)methyl]-1H-indol-2-yl}-4-(dimethylcarbamoyl)-6-phenylbenzen-1-olate | CRA-15441
TypeSmall organic molecule
Emp. Form.C24H22N4O2
Mol. Mass.398.4571
SMILESCN(C)C(=O)c1cc(-c2cc3cc(ccc3[nH]2)C(N)=[NH2+])c([O-])c(c1)-c1ccccc1