Reaction Details
TargetCoagulation factor VII
LigandBDBM14533
Substrate/CompetitorBDBM14496
Meas. Tech.TF-VIIa Assay
IC50 100±n/a nM
Citation Parlow, JJCase, BLDice, TAFenton, RLHayes, MJJones, DENeumann, WLWood, RSLachance, RMGirard, TJNicholson, NSClare, MStegeman, RAStevens, AMStallings, WCKurumbail, RGSouth, MS Design, parallel synthesis, and crystal structures of pyrazinone antithrombotics as selective inhibitors of the tissue factor VIIa complex. J Med Chem46:4050-62 (2003) 
 
Coagulation factor VII
Name:Coagulation factor VII
Type:Enzyme
Mol. Mass.:51599.89
Organism:Homo sapiens (Human)
Description:n/a
Residue:466
BDBM14533
BDBM14496
NameBDBM14533
Synonyms:2-[6-(3-aminophenyl)-3-(butylamino)-5-chloro-2-oxo-1,2-dihydropyrazin-1-yl]-N-[(4-carbamimidoylphenyl)methyl]acetamide | Pyrazinone Analog 29c
TypeSmall organic molecule
Emp. Form.C24H28ClN7O2
Mol. Mass.481.978
SMILESCCCCNc1nc(Cl)c(-c2cccc(N)c2)n(CC(=O)NCc2ccc(cc2)C(N)=N)c1=O