Reaction Details
TargetCoagulation factor VII
LigandBDBM14535
Substrate/CompetitorBDBM14496
Meas. Tech.TF-VIIa Assay
IC50 20±n/a nM
Citation Parlow, JJCase, BLDice, TAFenton, RLHayes, MJJones, DENeumann, WLWood, RSLachance, RMGirard, TJNicholson, NSClare, MStegeman, RAStevens, AMStallings, WCKurumbail, RGSouth, MS Design, parallel synthesis, and crystal structures of pyrazinone antithrombotics as selective inhibitors of the tissue factor VIIa complex. J Med Chem46:4050-62 (2003) 
 
Coagulation factor VII
Name:Coagulation factor VII
Type:Enzyme
Mol. Mass.:51599.89
Organism:Homo sapiens (Human)
Description:n/a
Residue:466
BDBM14535
BDBM14496
NameBDBM14535
Synonyms:2-[6-(3-aminophenyl)-5-chloro-2-oxo-3-(propan-2-ylamino)-1,2-dihydropyrazin-1-yl]-N-[(4-carbamimidoylphenyl)methyl]acetamide | Pyrazinone Analog 29d
TypeSmall organic molecule
Emp. Form.C23H26ClN7O2
Mol. Mass.467.951
SMILESCC(C)Nc1nc(Cl)c(-c2cccc(N)c2)n(CC(=O)NCc2ccc(cc2)C(N)=N)c1=O