Reaction Details
TargetProthrombin
LigandBDBM14590
Substrate/CompetitorBDBM12678
Meas. Tech.TF-VIIa Assay
IC50 110±n/a nM
Citation Parlow, JJCase, BLDice, TAFenton, RLHayes, MJJones, DENeumann, WLWood, RSLachance, RMGirard, TJNicholson, NSClare, MStegeman, RAStevens, AMStallings, WCKurumbail, RGSouth, MS Design, parallel synthesis, and crystal structures of pyrazinone antithrombotics as selective inhibitors of the tissue factor VIIa complex. J Med Chem46:4050-62 (2003) 
 
Prothrombin
Name:Prothrombin
Type:Protein
Mol. Mass.:70029.57
Organism:Homo sapiens (Human)
Description:P00734
Residue:622
BDBM14590
BDBM12678
NameBDBM14590
Synonyms:N-[(4-carbamimidoylphenyl)methyl]-2-[5-chloro-6-(3-acetamidophenyl)-2-oxo-3-[(2-phenylethyl)amino]-1,2-dihydropyrazin-1-yl]acetamide | Pyrazinone Analog 33c
TypeSmall organic molecule
Emp. Form.C30H30ClN7O3
Mol. Mass.572.057
SMILESCC(=O)Nc1cccc(c1)-c1c(Cl)nc(NCCc2ccccc2)c(=O)n1CC(=O)NCc1ccc(cc1)C(N)=N