Reaction Details
TargetHigh affinity nerve growth factor receptor
LigandBDBM344316
Substrate/Competitorn/a
Meas. Tech.TrkA ELISA Assay
IC50 0.400±n/a nM
Citation Allen, SAndrews, SWCondroski, KRHaas, JHuang, LJiang, YKercher, TSeo, J Substituted pyrazolo[1,5-a]pyrimidine compounds as Trk kinase inhibitors US Patent US9782415 Publication Date 10/10/2017
 
High affinity nerve growth factor receptor
Name:High affinity nerve growth factor receptor
Type:n/a
Mol. Mass.:87498.18
Organism:Homo sapiens (Human)
Description:P04629
Residue:796
BDBM344316
NameBDBM344316
Synonyms:US10251889, Example 25 US9782415, Example 25 | US9796724, Example 25
TypeSmall organic molecule
Emp. Form.C22H21F2N7O
Mol. Mass.437.4452
SMILESFc1ccc(F)c(c1)[C@H]1CCCN1c1ccn2ncc(C(=O)NCCc3c[nH]cn3)c2n1