Reaction Details
TargetDual specificity calcium/calmodulin-dependent 3',5'-cyclic nucleotide phosphodiesterase 1B
LigandBDBM14361
Substrate/CompetitorBDBM10851
Meas. Tech.Phosphodiesterase (PDE) Inhibition Assay
pH7.5±n/a
Temperature303.15±n/a K
IC50>200000±n/a nM
Citation Card, GLEngland, BPSuzuki, YFong, DPowell, BLee, BLuu, CTabrizizad, MGillette, SIbrahim, PNArtis, DRBollag, GMilburn, MVKim, SHSchlessinger, JZhang, KY Structural basis for the activity of drugs that inhibit phosphodiesterases. Structure12:2233-47 (2004) 
 
Dual specificity calcium/calmodulin-dependent 3',5'-cyclic nucleotide phosphodiesterase 1B
Name:Dual specificity calcium/calmodulin-dependent 3',5'-cyclic nucleotide phosphodiesterase 1B
Type:Enzyme
Mol. Mass.:61366.51
Organism:Homo sapiens (Human)
Description:n/a
Residue:536
BDBM14361
BDBM10851
NameBDBM14361
Synonyms:(R,S)-Rolipram 4-[3-(cyclopentyloxy)-4-methoxyphenyl]pyrrolidin-2-one CHEMBL63 | Rolipram
TypeSmall organic molecule
Emp. Form.C16H21NO3
Mol. Mass.275.3428
SMILESCOc1ccc(cc1OC1CCCC1)C1CNC(=O)C1