Reaction Details
TargetcGMP-inhibited 3',5'-cyclic phosphodiesterase 3B [650-1084]
LigandBDBM14774
Substrate/CompetitorBDBM10851
Meas. Tech.Phosphodiesterase (PDE) Inhibition Assay
IC50>200000±n/a nM
Citation Card, GLEngland, BPSuzuki, YFong, DPowell, BLee, BLuu, CTabrizizad, MGillette, SIbrahim, PNArtis, DRBollag, GMilburn, MVKim, SHSchlessinger, JZhang, KY Structural basis for the activity of drugs that inhibit phosphodiesterases. Structure12:2233-47 (2004) 
 
cGMP-inhibited 3',5'-cyclic phosphodiesterase 3B [650-1084]
Name:cGMP-inhibited 3',5'-cyclic phosphodiesterase 3B [650-1084]
Type:Enzyme
Mol. Mass.:49825.61
Organism:Homo sapiens (Human)
Description:Recombinant catalytic domain (Q650-A1084) of human PDE3B.
Residue:435
BDBM14774
BDBM10851
NameBDBM14774
Synonyms:3-(cyclopropylmethoxy)-N-(3,5-dichloropyridin-4-yl)-4-(difluoromethoxy)benzamide DAXAS Roflumilast
TypeSmall organic molecule
Emp. Form.C17H14Cl2F2N2O3
Mol. Mass.403.207
SMILESFC(F)Oc1ccc(cc1OCC1CC1)C(=O)Nc1c(Cl)cncc1Cl