Reaction Details
TargetcAMP-specific 3',5'-cyclic phosphodiesterase 4D [372-376,381-715,S375G,I381V,S383G,G384S,V385H,K386M)
LigandBDBM14772
Substrate/CompetitorBDBM10851
Meas. Tech.Phosphodiesterase (PDE) Inhibition Assay
IC50 1100±n/a nM
Citation Card, GLEngland, BPSuzuki, YFong, DPowell, BLee, BLuu, CTabrizizad, MGillette, SIbrahim, PNArtis, DRBollag, GMilburn, MVKim, SHSchlessinger, JZhang, KY Structural basis for the activity of drugs that inhibit phosphodiesterases. Structure12:2233-47 (2004) 
 
cAMP-specific 3',5'-cyclic phosphodiesterase 4D [372-376,381-715,S375G,I381V,S383G,G384S,V385H,K386M)
Name:cAMP-specific 3',5'-cyclic phosphodiesterase 4D [372-376,381-715,S375G,I381V,S383G,G384S,V385H,K386M)
Type:Enzyme Catalytic Domain
Mol. Mass.:40034.37
Organism:Homo sapiens (Human)
Description:RECOMBINANT CATALYTIC DOMAIN OF HUMAN PHOSPHODIESTERASE 4D.
Residue:349
BDBM14772
BDBM10851
NameBDBM14772
Synonyms:(R,S)-Mesopram 5-(4-methoxy-3-propoxyphenyl)-5-methyl-1,3-oxazolidin-2-one | Daxalipram
TypeSmall organic molecule
Emp. Form.C14H19NO4
Mol. Mass.265.305
SMILESCCCOc1cc(ccc1OC)C1(C)CNC(=O)O1