Reaction Details
TargetcAMP-specific 3',5'-cyclic phosphodiesterase 4D [372-376,381-715,S375G,I381V,S383G,G384S,V385H,K386M)
LigandBDBM14774
Substrate/CompetitorBDBM10851
Meas. Tech.Phosphodiesterase (PDE) Inhibition Assay
IC50 0.68±n/a nM
Citation Card, GLEngland, BPSuzuki, YFong, DPowell, BLee, BLuu, CTabrizizad, MGillette, SIbrahim, PNArtis, DRBollag, GMilburn, MVKim, SHSchlessinger, JZhang, KY Structural basis for the activity of drugs that inhibit phosphodiesterases. Structure12:2233-47 (2004) 
 
cAMP-specific 3',5'-cyclic phosphodiesterase 4D [372-376,381-715,S375G,I381V,S383G,G384S,V385H,K386M)
Name:cAMP-specific 3',5'-cyclic phosphodiesterase 4D [372-376,381-715,S375G,I381V,S383G,G384S,V385H,K386M)
Type:Enzyme Catalytic Domain
Mol. Mass.:40034.37
Organism:Homo sapiens (Human)
Description:RECOMBINANT CATALYTIC DOMAIN OF HUMAN PHOSPHODIESTERASE 4D.
Residue:349
BDBM14774
BDBM10851
NameBDBM14774
Synonyms:3-(cyclopropylmethoxy)-N-(3,5-dichloropyridin-4-yl)-4-(difluoromethoxy)benzamide DAXAS Roflumilast
TypeSmall organic molecule
Emp. Form.C17H14Cl2F2N2O3
Mol. Mass.403.207
SMILESFC(F)Oc1ccc(cc1OCC1CC1)C(=O)Nc1c(Cl)cncc1Cl