Reaction Details
TargetcAMP-specific 3',5'-cyclic phosphodiesterase 7B [91-450]
LigandBDBM14769
Substrate/CompetitorBDBM10851
Meas. Tech.Phosphodiesterase (PDE) Inhibition Assay
IC50>200000±n/a nM
Citation Card, GLEngland, BPSuzuki, YFong, DPowell, BLee, BLuu, CTabrizizad, MGillette, SIbrahim, PNArtis, DRBollag, GMilburn, MVKim, SHSchlessinger, JZhang, KY Structural basis for the activity of drugs that inhibit phosphodiesterases. Structure12:2233-47 (2004) 
 
cAMP-specific 3',5'-cyclic phosphodiesterase 7B [91-450]
Name:cAMP-specific 3',5'-cyclic phosphodiesterase 7B [91-450]
Type:Enzyme Catalytic Domain
Mol. Mass.:41494.16
Organism:Homo sapiens (Human)
Description:Recombinant catalytic domain (Q91-P450) of human PDE7B.
Residue:360
BDBM14769
BDBM10851
NameBDBM14769
Synonyms:6-(3,4-Dimethoxy-phenyl)-4,5-dimethyl-4,5-dihydro-2H-pyridazin-3-one 6-(4-Difluoromethoxy-3-methoxy-phenyl)-2H-pyridazin-3-one CHEMBL313842 Zardaverine
TypeSmall organic molecule
Emp. Form.C12H10F2N2O3
Mol. Mass.268.2162
SMILESCOc1cc(ccc1OC(F)F)-c1ccc(=O)[nH]n1