Reaction Details
TargetHigh affinity cGMP-specific 3',5'-cyclic phosphodiesterase 9A [226-593]
LigandBDBM14769
Substrate/CompetitorBDBM14391
IC50>200000±n/a nM
Citation Card, GLEngland, BPSuzuki, YFong, DPowell, BLee, BLuu, CTabrizizad, MGillette, SIbrahim, PNArtis, DRBollag, GMilburn, MVKim, SHSchlessinger, JZhang, KY Structural basis for the activity of drugs that inhibit phosphodiesterases. Structure12:2233-47 (2004) 
 
High affinity cGMP-specific 3',5'-cyclic phosphodiesterase 9A [226-593]
Name:High affinity cGMP-specific 3',5'-cyclic phosphodiesterase 9A [226-593]
Type:Enzyme Catalytic Domain
Mol. Mass.:43183.20
Organism:Homo sapiens (Human)
Description:Recombinant catalytic domain (S226-A593) of human PDE9A.
Residue:368
BDBM14769
BDBM14391
NameBDBM14769
Synonyms:6-(3,4-Dimethoxy-phenyl)-4,5-dimethyl-4,5-dihydro-2H-pyridazin-3-one 6-(4-Difluoromethoxy-3-methoxy-phenyl)-2H-pyridazin-3-one CHEMBL313842 Zardaverine
TypeSmall organic molecule
Emp. Form.C12H10F2N2O3
Mol. Mass.268.2162
SMILESCOc1cc(ccc1OC(F)F)-c1ccc(=O)[nH]n1