Reaction Details
TargetcAMP-specific 3',5'-cyclic phosphodiesterase 4B [316-320,321-700,S319G,N320S,N321H,T322M]
LigandBDBM14784
Substrate/CompetitorBDBM10851
Meas. Tech.Phosphodiesterase (PDE) Inhibition Assay
pH7.5±n/a
Temperature303.15±n/a K
IC50 15000±n/a nM
Citation Card, GLBlasdel, LEngland, BPZhang, CSuzuki, YGillette, SFong, DIbrahim, PNArtis, DRBollag, GMilburn, MVKim, SHSchlessinger, JZhang, KY A family of phosphodiesterase inhibitors discovered by cocrystallography and scaffold-based drug design. Nat Biotechnol23:201-7 (2005) 
 
cAMP-specific 3',5'-cyclic phosphodiesterase 4B [316-320,321-700,S319G,N320S,N321H,T322M]
Name:cAMP-specific 3',5'-cyclic phosphodiesterase 4B [316-320,321-700,S319G,N320S,N321H,T322M]
Type:Enzyme Catalytic Domain
Mol. Mass.:45579.64
Organism:Homo sapiens (Human)
Description:RECOMBINANT CATALYTIC DOMAIN OF HUMAN PHOSPHODIESTERASE 4B.
Residue:398
BDBM14784
BDBM10851
NameBDBM14784
Synonyms:Pyrazole carboxylic ester 7 ethyl 3-amino-5-(4-methoxyphenyl)-1H-pyrazole-4-carboxylate
TypeSmall organic molecule
Emp. Form.C13H15N3O3
Mol. Mass.261.2765
SMILESCCOC(=O)c1c(N)[nH]nc1-c1ccc(OC)cc1