Reaction Details
TargetcAMP-specific 3',5'-cyclic phosphodiesterase 4B [316-320,321-700,S319G,N320S,N321H,T322M]
LigandBDBM14788
Substrate/CompetitorBDBM10851
Meas. Tech.Phosphodiesterase (PDE) Inhibition Assay
pH7.5±n/a
Temperature303.15±n/a K
IC50 25000±n/a nM
Citation Card, GLBlasdel, LEngland, BPZhang, CSuzuki, YGillette, SFong, DIbrahim, PNArtis, DRBollag, GMilburn, MVKim, SHSchlessinger, JZhang, KY A family of phosphodiesterase inhibitors discovered by cocrystallography and scaffold-based drug design. Nat Biotechnol23:201-7 (2005) 
 
cAMP-specific 3',5'-cyclic phosphodiesterase 4B [316-320,321-700,S319G,N320S,N321H,T322M]
Name:cAMP-specific 3',5'-cyclic phosphodiesterase 4B [316-320,321-700,S319G,N320S,N321H,T322M]
Type:Enzyme Catalytic Domain
Mol. Mass.:45579.64
Organism:Homo sapiens (Human)
Description:RECOMBINANT CATALYTIC DOMAIN OF HUMAN PHOSPHODIESTERASE 4B.
Residue:398
BDBM14788
BDBM10851
NameBDBM14788
Synonyms:Pyrazole carboxylic ester 11 | ethyl 5-amino-1-{8-thia-4,6-diazatricyclo[7.4.0.0^{2,7}]trideca-1(9),2(7),3,5-tetraen-3-yl}-1H-pyrazole-4-carboxylate
TypeSmall organic molecule
Emp. Form.C16H17N5O2S
Mol. Mass.343.403
SMILESCCOC(=O)c1cnn(c1N)-c1ncnc2sc3CCCCc3c12