Reaction Details
TargetG protein-activated inward rectifier potassium channel 4
LigandBDBM347074
Substrate/Competitorn/a
Meas. Tech.TBD
IC50 2.00±n/a nM
Citation Duncia, JVGardner, DSHynes, JMacor, JENair, SKPaidi, VRSantella, JBSarkunam, KSistla, RKPolimera, SRWu, H Heteroaryl substituted aminopyridine compounds US Patent US10202390 Publication Date 2/12/2019
 
G protein-activated inward rectifier potassium channel 4
Name:G protein-activated inward rectifier potassium channel 4
Type:PROTEIN
Mol. Mass.:47658.06
Organism:Homo sapiens (Human)
Description:ChEMBL_107914
Residue:419
BDBM347074
NameBDBM347074
Synonyms:US10202390, Example 29
TypeSmall organic molecule
Emp. Form.C25H28N8O2
Mol. Mass.472.5422
SMILESCC(C)(O)CCc1cc(n[nH]1)-c1cnc(cc1NC1CCOCC1)-c1cnn2cc(cnc12)C#N