Reaction Details
TargetE3 ubiquitin-protein ligase Mdm2 [17-125]
LigandBDBM221505
Substrate/Competitorn/a
Meas. Tech.FRET Assay
Temperature298.15±n/a K
IC50 0.7528±n/a nM
Commentsassayid=2 extracted
Citation Cammarano, CMChristopher, MPDinsmore, CDoll, RJFradera Llinas, FXLi, CMachacek, MMartinez, MNair, LGPan, WReutershan, MHShizuka, MSteinhuebel, DPSun, BThompson, CFTrotter, BWWang, YYang, LBogen, SLVoss, MEPanda, JKurissery, AT 2,6,7,8 substituted purines as HDM2 inhibitors US Patent US9540377 Publication Date 1/10/2017
 
E3 ubiquitin-protein ligase Mdm2 [17-125]
Name:E3 ubiquitin-protein ligase Mdm2 [17-125]
Type:Enzyme Catalytic Domain
Mol. Mass.:12522.24
Organism:Homo sapiens (Human)
Description:Residue 17 to 125
Residue:109
BDBM221505
NameBDBM221505
Synonyms:6-{[(1r)-1- cyclobutylethyl]amino}- 8-{[(1s)-1-(3- fluorophenyl)ethyl] amino}-7-[4- (trifluoromethypbenzyl]- 7h-purine-2- carboxylic acid | US9540377, 9.39
TypeSmall organic molecule
Emp. Form.C28H28F4N6O2
Mol. Mass.556.5545
SMILESC[C@@H](Nc1nc(nc2nc(N[C@@H](C)c3cccc(F)c3)n(Cc3ccc(cc3)C(F)(F)F)c12)C(O)=O)C1CCC1