Reaction Details
TargetE3 ubiquitin-protein ligase Mdm2 [17-125]
LigandBDBM223703
Substrate/Competitorn/a
Meas. Tech.FRET Assay
Temperature298.15±n/a K
IC50 0.7883±n/a nM
Commentsextracted
Citation Cammarano, CMChristopher, MPDinsmore, CDoll, RJFradera Llinas, FXLi, CMachacek, MMartinez, MNair, LGPan, WReutershan, MHShizuka, MSteinhuebel, DPSun, BThompson, CFTrotter, BWWang, YYang, LBogen, SLVoss, MEPanda, JKurissery, AT 2,6,7,8 substituted purines as HDM2 inhibitors US Patent US9540377 Publication Date 1/10/2017
 
E3 ubiquitin-protein ligase Mdm2 [17-125]
Name:E3 ubiquitin-protein ligase Mdm2 [17-125]
Type:Enzyme Catalytic Domain
Mol. Mass.:12522.24
Organism:Homo sapiens (Human)
Description:Residue 17 to 125
Residue:109
BDBM223703
NameBDBM223703
Synonyms:3-(6-{[(1r)-1- cyclobutylethyl]amino}- 8-[(3r,5r)-3,5- dimethylmorpholin- 4-yl]-7-[(trans-4- methylcyclohexyl) methyl]-7h-purin-2- yl)-1,2,4-oxadiazol- 5(4h)-one | US9540377, 11.129
TypeSmall organic molecule
Emp. Form.C27H40N8O3
Mol. Mass.524.6583
SMILESC[C@@H](Nc1nc(nc2nc(N3[C@H](C)COC[C@H]3C)n(C[C@H]3CC[C@H](C)CC3)c12)-c1noc(=O)[nH]1)C1CCC1