Reaction Details
TargetE3 ubiquitin-protein ligase Mdm2 [17-125]
LigandBDBM223737
Substrate/Competitorn/a
Meas. Tech.FRET Assay
Temperature298.15±n/a K
IC50 0.790±n/a nM
Commentsextracted
Citation Cammarano, CMChristopher, MPDinsmore, CDoll, RJFradera Llinas, FXLi, CMachacek, MMartinez, MNair, LGPan, WReutershan, MHShizuka, MSteinhuebel, DPSun, BThompson, CFTrotter, BWWang, YYang, LBogen, SLVoss, MEPanda, JKurissery, AT 2,6,7,8 substituted purines as HDM2 inhibitors US Patent US9540377 Publication Date 1/10/2017
 
E3 ubiquitin-protein ligase Mdm2 [17-125]
Name:E3 ubiquitin-protein ligase Mdm2 [17-125]
Type:Enzyme Catalytic Domain
Mol. Mass.:12522.24
Organism:Homo sapiens (Human)
Description:Residue 17 to 125
Residue:109
BDBM223737
NameBDBM223737
Synonyms:5-(6-{[(1r)-1- cyclobutylethyl]amino}- 7-[(trans-4- methylcyclohexyl) methyl]-8-[(2r,3r)-2- methyl-3- phenylmorpholin-4- yl]-7h-purin-2-yl)- 1,3,4-oxadiazol- 2(3h)-one | US9540377, 11.166
TypeSmall organic molecule
Emp. Form.C32H42N8O3
Mol. Mass.586.7277
SMILESC[C@@H](Nc1nc(nc2nc(N3CCO[C@H](C)[C@H]3c3ccccc3)n(C[C@H]3CC[C@H](C)CC3)c12)-c1n[nH]c(=O)o1)C1CCC1