Reaction Details
TargetE3 ubiquitin-protein ligase Mdm2 [17-125]
LigandBDBM223756
Substrate/Competitorn/a
Meas. Tech.FRET Assay
Temperature298.15±n/a K
IC50 0.5847±n/a nM
Commentsextracted
Citation Cammarano, CMChristopher, MPDinsmore, CDoll, RJFradera Llinas, FXLi, CMachacek, MMartinez, MNair, LGPan, WReutershan, MHShizuka, MSteinhuebel, DPSun, BThompson, CFTrotter, BWWang, YYang, LBogen, SLVoss, MEPanda, JKurissery, AT 2,6,7,8 substituted purines as HDM2 inhibitors US Patent US9540377 Publication Date 1/10/2017
 
E3 ubiquitin-protein ligase Mdm2 [17-125]
Name:E3 ubiquitin-protein ligase Mdm2 [17-125]
Type:Enzyme Catalytic Domain
Mol. Mass.:12522.24
Organism:Homo sapiens (Human)
Description:Residue 17 to 125
Residue:109
BDBM223756
NameBDBM223756
Synonyms:6-{[(1r)-1- cyclobutylethyl]amino}- 7-[(trans-4- methylcyclohexyl)methyl]- n-(methylsulfonyl)-8- [(3r)-3-phenylmorpholin- 4-yl]-7h-purine-2- carboxamide | US9540377, 12.18
TypeSmall organic molecule
Emp. Form.C31H43N7O4S
Mol. Mass.609.783
SMILESC[C@@H](Nc1nc(nc2nc(N3CCOC[C@H]3c3ccccc3)n(C[C@H]3CC[C@H](C)CC3)c12)C(=O)NS(C)(=O)=O)C1CCC1