Reaction Details
TargetE3 ubiquitin-protein ligase Mdm2 [17-125]
LigandBDBM224239
Substrate/Competitorn/a
Meas. Tech.FRET Assay
Temperature298.15±n/a K
IC50 0.601±n/a nM
Commentsextracted
Citation Cammarano, CMChristopher, MPDinsmore, CDoll, RJFradera Llinas, FXLi, CMachacek, MMartinez, MNair, LGPan, WReutershan, MHShizuka, MSteinhuebel, DPSun, BThompson, CFTrotter, BWWang, YYang, LBogen, SLVoss, MEPanda, JKurissery, AT 2,6,7,8 substituted purines as HDM2 inhibitors US Patent US9540377 Publication Date 1/10/2017
 
E3 ubiquitin-protein ligase Mdm2 [17-125]
Name:E3 ubiquitin-protein ligase Mdm2 [17-125]
Type:Enzyme Catalytic Domain
Mol. Mass.:12522.24
Organism:Homo sapiens (Human)
Description:Residue 17 to 125
Residue:109
BDBM224239
NameBDBM224239
Synonyms:3-{6-(5-chloro-2- methylpyridin-3-yl)- 7-[(trans-4- methylcyclohexyl) methyl]-8-[(3r)-3- phenylmorpholin-4- yl]-7h-purin-2-yl}- 1,2,4-oxadiazol- 5(4h)-one | US9540377, 16.158
TypeSmall organic molecule
Emp. Form.C31H33ClN8O3
Mol. Mass.601.099
SMILESC[C@H]1CC[C@H](Cn2c(nc3nc(nc(-c4cc(Cl)cnc4C)c23)-c2noc(=O)[nH]2)N2CCOC[C@H]2c2ccccc2)CC1