Reaction Details
TargetE3 ubiquitin-protein ligase Mdm2 [17-125]
LigandBDBM224295
Substrate/Competitorn/a
Meas. Tech.FRET Assay
Temperature298.15±n/a K
IC50 0.5478±n/a nM
Commentsextracted
Citation Cammarano, CMChristopher, MPDinsmore, CDoll, RJFradera Llinas, FXLi, CMachacek, MMartinez, MNair, LGPan, WReutershan, MHShizuka, MSteinhuebel, DPSun, BThompson, CFTrotter, BWWang, YYang, LBogen, SLVoss, MEPanda, JKurissery, AT 2,6,7,8 substituted purines as HDM2 inhibitors US Patent US9540377 Publication Date 1/10/2017
 
E3 ubiquitin-protein ligase Mdm2 [17-125]
Name:E3 ubiquitin-protein ligase Mdm2 [17-125]
Type:Enzyme Catalytic Domain
Mol. Mass.:12522.24
Organism:Homo sapiens (Human)
Description:Residue 17 to 125
Residue:109
BDBM224295
NameBDBM224295
Synonyms:6-{[(1r)-1-cyclobutylethyl]amino}- 7-[(trans-4-ethylcyclohexyl)methyl]- 8-[(3r)-3-phenylmorpholin-4-yl]- 7h-purine-2-carboxylic acid | US9540377, 18.21
TypeSmall organic molecule
Emp. Form.C31H42N6O3
Mol. Mass.546.7036
SMILESCC[C@H]1CC[C@H](Cn2c(nc3nc(nc(N[C@H](C)C4CCC4)c23)C(O)=O)N2CCOC[C@H]2c2ccccc2)CC1