Reaction Details
TargetE3 ubiquitin-protein ligase Mdm2 [17-125]
LigandBDBM224851
Substrate/Competitorn/a
Meas. Tech.FRET Assay
Temperature298.15±n/a K
IC50 0.563±n/a nM
Commentsextracted
Citation Cammarano, CMChristopher, MPDinsmore, CDoll, RJFradera Llinas, FXLi, CMachacek, MMartinez, MNair, LGPan, WReutershan, MHShizuka, MSteinhuebel, DPSun, BThompson, CFTrotter, BWWang, YYang, LBogen, SLVoss, MEPanda, JKurissery, AT 2,6,7,8 substituted purines as HDM2 inhibitors US Patent US9540377 Publication Date 1/10/2017
 
E3 ubiquitin-protein ligase Mdm2 [17-125]
Name:E3 ubiquitin-protein ligase Mdm2 [17-125]
Type:Enzyme Catalytic Domain
Mol. Mass.:12522.24
Organism:Homo sapiens (Human)
Description:Residue 17 to 125
Residue:109
BDBM224851
NameBDBM224851
Synonyms:3-(6-{[(1r)-1- cyclobutylethyl]amino}-8-[1- fluoro-1-(2- fluorophenyl)ethyl]-7-[(trans- 4-methylcyclohexyl)methyl]- 7h-purin-2-yl)-1,2,4- oxadiazol-5(4h)-one (diastereomer 1) US9540377, 22.65
TypeSmall organic molecule
Emp. Form.C29H35F2N7O2
Mol. Mass.551.6307
SMILESC[C@@H](Nc1nc(nc2nc(n(C[C@H]3CC[C@H](C)CC3)c12)C(C)(F)c1ccccc1F)-c1noc(=O)[nH]1)C1CCC1