Reaction Details
TargetFibroblast growth factor receptor 3
LigandBDBM350051
Substrate/Competitorn/a
Meas. Tech.Enzyme Assay
IC50 1.80±n/a nM
Citation Andrews, SWBlake, JFCook, AGunawardana, IWHunt, KWMetcalf, ATMoreno, DRen, LTang, TP 2-aryl- and 2-heteroaryl-substituted 2-pyridazin-3(2H)-one compounds as inhibitors of FGFR tyrosine kinases US Patent US10208024 Publication Date 2/19/2019
 
Fibroblast growth factor receptor 3
Name:Fibroblast growth factor receptor 3
Type:Protein
Mol. Mass.:87699.57
Organism:Homo sapiens (Human)
Description:P22607
Residue:806
BDBM350051
NameBDBM350051
Synonyms:US10208024, Example 50 | US10766881, Example 50
TypeSmall organic molecule
Emp. Form.C25H28N8O3
Mol. Mass.488.5416
SMILESCOc1cc(OC)cc(c1)-n1nc(cc(C)c1=O)-c1nc(cnc1N)-c1cnn(c1)C1CCNCC1