Reaction Details
TargetTyrosine-protein kinase BTK
LigandBDBM352190
Substrate/Competitorn/a
Meas. Tech.TR-FRET (Time Resolved FRET) Assay
IC50 3.00±n/a nM
Citation Dominique, RKong, NLou, YLopez-Tapia, FJSo, S Inhibitors of bruton's tyrosine kinase US Patent US9802920 Publication Date 10/31/2017
 
Tyrosine-protein kinase BTK
Name:Tyrosine-protein kinase BTK
Type:Enzyme
Mol. Mass.:76289.95
Organism:Homo sapiens (Human)
Description:Q06187
Residue:659
BDBM352190
NameBDBM352190
Synonyms:US9802920, Compound I-14 | {5-Amino-1-[4-(2,3- difluoro-phenoxy)-2-methyl- phenyl]-1H-pyrazol-4-yl}- (1H-indol-2-yl)-methanone
TypeSmall organic molecule
Emp. Form.C25H18F2N4O2
Mol. Mass.444.4328
SMILESCc1cc(Oc2cccc(F)c2F)ccc1-n1ncc(C(=O)c2cc3ccccc3[nH]2)c1N