Reaction Details
TargetCoagulation factor IX
LigandBDBM352461
Substrate/Competitorn/a
Meas. Tech.Factor XIa Assay
Ki 6.00±n/a nM
Citation Ogawa, AEdmondson, SErion, MNeelamkavil, SGuo, ZMal, RHe, JLiu, WVande Bunte, EK Factor XIa inhibitors US Patent US9809545 Publication Date 11/7/2017
 
Coagulation factor IX
Name:Coagulation factor IX
Type:Enzyme
Mol. Mass.:51768.83
Organism:Homo sapiens (Human)
Description:P00740
Residue:461
BDBM352461
NameBDBM352461
Synonyms:US9809545, 1Ff
TypeSmall organic molecule
Emp. Form.C28H21ClN6O4
Mol. Mass.540.957
SMILESOC(=O)c1ccc(NC(=O)[C@@H](Cc2ccccc2)n2ccc(cc2=O)-c2cc(Cl)ccc2-n2cnnn2)cc1