Reaction Details
TargetCoagulation factor IX
LigandBDBM352470
Substrate/Competitorn/a
Meas. Tech.Factor XIa Assay
Ki 154±n/a nM
Citation Ogawa, AEdmondson, SErion, MNeelamkavil, SGuo, ZMal, RHe, JLiu, WVande Bunte, EK Factor XIa inhibitors US Patent US9809545 Publication Date 11/7/2017
 
Coagulation factor IX
Name:Coagulation factor IX
Type:Enzyme
Mol. Mass.:51768.83
Organism:Homo sapiens (Human)
Description:P00740
Residue:461
BDBM352470
NameBDBM352470
Synonyms:US9809545, 4Af
TypeSmall organic molecule
Emp. Form.C24H17ClF3N7O
Mol. Mass.511.886
SMILESFC(F)(F)c1c[nH]c(n1)C(Cc1ccccc1)n1ccc(cc1=O)-c1cc(Cl)ccc1-n1cnnn1