Reaction Details
TargetCoagulation factor IX
LigandBDBM352478
Substrate/Competitorn/a
Meas. Tech.Factor XIa Assay
Ki<5.00±n/a nM
Citation Ogawa, AEdmondson, SErion, MNeelamkavil, SGuo, ZMal, RHe, JLiu, WVande Bunte, EK Factor XIa inhibitors US Patent US9809545 Publication Date 11/7/2017
 
Coagulation factor IX
Name:Coagulation factor IX
Type:Enzyme
Mol. Mass.:51768.83
Organism:Homo sapiens (Human)
Description:P00740
Residue:461
BDBM352478
NameBDBM352478
Synonyms:US9809545, 5b
TypeSmall organic molecule
Emp. Form.C27H20ClFN7O4P
Mol. Mass.591.917
SMILESOP(O)(=O)c1ccc2[nH]c(nc2c1)[C@H](Cc1ccc(F)cc1)n1ccc(cc1=O)-c1cc(Cl)ccc1-n1cnnn1