Reaction Details
TargetProthrombin
LigandBDBM17297
Substrate/CompetitorBDBM17296
Meas. Tech.Determination of Inhibition Constants
pH8±n/a
Temperature310.15±n/a K
Ki 780±50 nM
Citation Nar, HBauer, MSchmid, AStassen, JMWienen, WPriepke, HWKauffmann, IKRies, UJHauel, NH Structural basis for inhibition promiscuity of dual specific thrombin and factor Xa blood coagulation inhibitors. Structure9:29-37 (2001) 
 
Prothrombin
Name:Prothrombin
Type:Protein
Mol. Mass.:70029.57
Organism:Homo sapiens (Human)
Description:P00734
Residue:622
BDBM17297
BDBM17296
NameBDBM17297
Synonyms:4-[({1-methyl-5-[(2-methyl-1H-1,3-benzodiazol-1-yl)methyl]-1H-1,3-benzodiazol-2-yl}methyl)amino]benzene-1-carboximidamide | BIBR1109
TypeSmall organic molecule
Emp. Form.C25H25N7
Mol. Mass.423.5129
SMILESCc1nc2ccccc2n1Cc1ccc2n(C)c(CNc3ccc(cc3)C(N)=N)nc2c1