Reaction Details
TargetProtein O-GlcNAcase
LigandBDBM205425
Substrate/Competitorn/a
Meas. Tech.Inhibition Assay
Ki 1.40±n/a nM
Citation Kaul, RMcEachern, EJMu, CSelnick, HGVocadlo, DJWang, YWei, ZZhou, YZhu, Y Selective glycosidase inhibitors and uses thereof US Patent US9815861 Publication Date 11/14/2017
 
Protein O-GlcNAcase
Name:Protein O-GlcNAcase
Type:Enzyme
Mol. Mass.:102874.67
Organism:Homo sapiens (Human)
Description:O60502
Residue:916
BDBM205425
NameBDBM205425
Synonyms:US9243020, 20 | US9815861, Example 20
TypeSmall organic molecule
Emp. Form.C9H14F2N2O3S
Mol. Mass.268.281
SMILESCN(C)C1=N[C@H]2[C@H](O[C@H](C(F)F)[C@@H](O)[C@@H]2O)S1