Reaction Details
TargetCoagulation factor X
LigandBDBM12538
Substrate/CompetitorBDBM17640
Meas. Tech.In Vitro Assay for Inhibition of Factor Xa
pH7.4±n/a
Temperature295.15±n/a K
Ki 6±2 nM
Citation Chan, CBorthwick, ADBrown, DBurns-Kurtis, CLCampbell, MChaudry, LChung, CWConvery, MAHamblin, JNJohnstone, LKelly, HAKleanthous, SPatikis, APatel, CPateman, AJSenger, SShah, GPToomey, JRWatson, NSWeston, HEWhitworth, CYoung, RJZhou, P Factor Xa inhibitors: S1 binding interactions of a series of N-{(3S)-1-[(1S)-1-methyl-2-morpholin-4-yl-2-oxoethyl]-2-oxopyrrolidin-3-yl}sulfonamides. J Med Chem50:1546-57 (2007) 
 
Coagulation factor X
Name:Coagulation factor X
Type:Enzyme
Mol. Mass.:54726.60
Organism:Homo sapiens (Human)
Description:n/a
Residue:488
BDBM12538
BDBM17640
NameBDBM12538
Synonyms:6-chloro-N-[(3S)-1-[(2S)-1-(morpholin-4-yl)-1-oxopropan-2-yl]-2-oxopyrrolidin-3-yl]naphthalene-2-sulfonamide aminopyrrolidin-2-one 1 | pyrrolidin-2-one-based inhibitor 24
TypeSmall organic molecule
Emp. Form.C21H24ClN3O5S
Mol. Mass.465.95
SMILESC[C@H](N1CC[C@H](NS(=O)(=O)c2ccc3cc(Cl)ccc3c2)C1=O)C(=O)N1CCOCC1